{"text_format":"1","workbook":"xlsx","n_sheets":7,"sheets":["(はじめにお読み下さい)申請書の使い方","申請書","申請額一覧","別添","個票1","職員表","計算用"],"not_rendered":{"charts":0,"images":0,"macros":1,"external_links":0,"defined_names":7,"comments":5,"pivot_tables":0},"unopened":[],"bounds":{"document_bytes":16777216,"sheet_cells":100000,"rows_first":2000,"rows_last":500,"rows_between":2000,"halvings":0,"cell_chars":16384,"cell_head_chars":4096},"cells_cut":0,"cells_raw":0,"read":"whole","date_system":"1900"}

{"sheet":"(はじめにお読み下さい)申請書の使い方","index":0,"n_rows":19,"n_cols":4,"rows_kept":19,"cut":false,"hidden":false,"merged":[[1,0,1,3],[5,0,5,3],[3,0,4,3]]}
[]
["本変更承認申請書の使い方、変更承認申請の手順"]
[]
["各シートの着色されていないセル（白色のセル）には数式等が入っていますので入力不要です。\n誤って入力しないよう注意してください。\n（シート「申請額一覧」と「別添」は最終的に自動入力されます。何も入力しないでください。）\n（セルの保護がかかっているのは「申請書」と「個票」のみです。）"]
[]
["別紙様式１、別添、別紙様式２及び別紙様式３については、追加申請する事業所・サービス分、事業メニュー分のみ作成してください。(追加する金額・品目等のみ記載)\n様式第３号（申請書）については、既に交付決定を受けている額を「交付決定済額」に記載してください。\""]
["手順","都道府県の作業","事業者（法人本部）の作業","各事業所の作業"]
[1,"本Excelを管内の介護サービス事業者に配布"]
[{"$f":"A8+1","v":2},null,"本Excelを各事業所に配布し、以下の様式への記入を依頼\n・別紙様式２（個票）\n・別紙様式３（職員票）\n※Excelファイルを開封した際は、｢コンテンツの有効化｣をクリック"]
[3,null,null,"以下の作業を行った上で、事業者（法人本部）へ返送\n【別紙様式２（個票）】\n・水色セル：必要情報を入力\n・緑色セル：プルダウンから選択\n【別紙様式３（職員票）】\n・当該事業所の従事者から、慰労金代理申請・受領委任状を受領\n・当該委任状の提出のあった職員について、別紙様式３に取りまとめ(青色及び緑色のセルに入力)"]
[4,null,"各事業所の個票のシートを１つのExcelファイルに集約し、個票シート名を「個票●」（●は１からの通し番号）に修正"]
[5,null,"各事業所の別紙様式３（職員表）を法人単位で一覧表として取りまとめ\n兼務する複数の介護サービス事業所等から重複して申請している者がいないかを確認\n※氏名（漢字、カナ）、生年月日が一致する者がいる場合、「重複申請者確認用」欄に「可」と表示されません。\n※記入欄が不足する場合は、6行目～85行目を行ごとコピーし、86行目に右クリック→「コピーしたセルの挿入」で挿入。"]
[6,null,"別紙様式２（個票）の内容が、別添（サービス別一覧）に正しく反映されていることを確認\n※別添の記入欄が不足する場合は、6行目～20行目を行ごとコピーし、21行目に右クリック→「コピーしたセルの挿入」で挿入。"]
[7,null,"別紙様式１（申請額一覧）の「リスト作成」ボタンを押す。（事業所番号単位のリストが自動生成される）\n※この機能は100事業所分まで対応しています。"]
[8,null,"申請書に、申請者の法人所在地、法人名、代表者名、日付を入力し、提出先が静岡県知事であることを確認する"]
{"$rows_left_out":5}
{"sheet":"申請書","index":1,"n_rows":49,"n_cols":62,"rows_kept":49,"cut":false,"hidden":false,"merged":[[2,29,2,30],[2,32,2,33],[2,35,2,36],[4,0,4,6],[5,14,5,21],[5,22,5,36],[6,22,6,36],[7,22,7,36],[9,0,9,38],[11,1,11,2],[11,8,11,10],[11,11,11,12],[11,14,11,15],[11,17,11,18],[11,19,11,38],[16,1,16,9],[16,10,16,17],[17,1,17,9],[17,10,17,17],[18,1,18,9],[18,10,18,17],[22,2,22,22],[22,23,22,27],[23,2,23,22],[23,23,23,27],[23,47,23,48],[23,53,23,54],[23,59,23,60],[24,2,24,22],[24,23,24,27],[24,47,24,48],[24,53,24,54],[24,59,24,60],[25,2,25,22],[25,23,25,27],[43,29,43,32],[44,28,44,36],[45,20,45,26],[45,28,45,36],[46,20,46,26],[46,28,46,36],[47,24,47,27],[47,28,47,36],[48,24,48,27],[48,28,48,36],[35,2,38,37],[43,20,44,27],[47,20,48,22]]}
["様式第３号（用紙　日本産業規格Ａ４縦型）"]
[]
[null,null,null,null,null,null,null,null,null,null,null,null,null,null,null,null,null,null,null,null,null,null,null,null,null,null,null,null,"　　令和",null,null,"年",null,null,"月",null,null,"日"]
[]
["静岡県知事",null,null,null,null,null,null,null,"様"]
[null,null,null,null,null,null,null,null,null,null,null,null,null,null,"（所在地）"]
[null,null,null,null,null,null,null,null,null,null,null,null,null,null,"（法人名）"]
[null,null,null,null,null,null,null,null,null,null,null,null,null,null,"（役職・代表者名）",null,null,null,null,null,null,null,null,null,null,null,null,null,null,null,null,null,null,null,null,null,null,"印"]
[]
["変更計画承認申請書"]
[]
[null,"令和",null,null,"年",null,"月",null,"日付け",null,null,"福指",null,"第",null,null,"-",null,null,"号で交付金の交付の決定を受けた新型コロナ"]
["ウイルス感染症緊急包括支援交付金（介護分）の事業計画を次のとおり変更したいので、"]
["承認されるよう関係書類を添えて申請します。"]
[]
{"$rows_left_out":35}
{"sheet":"申請額一覧","index":2,"n_rows":104,"n_cols":14,"rows_kept":104,"cut":false,"hidden":false,"merged":[[2,7,2,12],[2,0,3,0],[2,1,3,1],[2,2,3,2],[2,3,3,3],[2,4,3,4],[2,5,3,5],[2,6,3,6],[2,13,3,13]]}
["（別紙様式１）事業所・施設別申請額一覧"]
[]
["No.","介護保険\n事業所番号","事業所・施設名","電話番号","郵便番号","住所","代表となる\n事業所・施設名","補助予定額（千円）",null,null,null,null,null,"審査\n結果"]
[null,null,null,null,null,null,null,"介護\n慰労金","20万円\n対象者の\n有無","感染対策\n費用助成\n事業","個別再開\n支援助成\n事業","再開環境\n整備助成\n事業","合計"]
[{"$f":"ROW()-4","v":1},0,{"$f":"IFERROR(VLOOKUP($B5,別添!$B$5:$G$29,2,FALSE),\"\")","v":0},{"$f":"IFERROR(VLOOKUP($B5,別添!$B$5:$G$29,4,FALSE),\"\")","v":0},{"$f":"IFERROR(VLOOKUP($B5,別添!$B$5:$G$29,5,FALSE),\"\")","v":0},{"$f":"IFERROR(VLOOKUP($B5,別添!$B$5:$G$29,6,FALSE),\"\")","v":""},{"$f":"IF(M5>0,申請書!$W$7,\"\")","v":""},{"$f":"SUMIFS(別添!I$5:I$29,別添!$B$5:$B$29,$B5)","v":0},{"$f":"IFERROR(IF(COUNTIFS(別添!$B$5:$B$29,B5,別添!$J$5:$J$29,\"有\")>0,\"有\",\"\"),\"\")","v":""},{"$f":"SUMIFS(別添!K$5:K$29,別添!$B$5:$B$29,$B5)","v":0},{"$f":"SUMIFS(別添!L$5:L$29,別添!$B$5:$B$29,$B5)","v":0},{"$f":"SUMIFS(別添!M$5:M$29,別添!$B$5:$B$29,$B5)","v":0},{"$f":"SUM(H5,J5,K5,L5)","v":0}]
[2,"",{"$f":"IFERROR(VLOOKUP($B6,別添!$B$5:$G$29,2,FALSE),\"\")","v":""},{"$f":"IFERROR(VLOOKUP($B6,別添!$B$5:$G$29,4,FALSE),\"\")","v":""},{"$f":"IFERROR(VLOOKUP($B6,別添!$B$5:$G$29,5,FALSE),\"\")","v":""},{"$f":"IFERROR(VLOOKUP($B6,別添!$B$5:$G$29,6,FALSE),\"\")","v":""},{"$f":"IF(M6>0,申請書!$W$7,\"\")","v":""},{"$f":"SUMIFS(別添!I$5:I$29,別添!$B$5:$B$29,$B6)","v":0},{"$f":"IFERROR(IF(COUNTIFS(別添!$B$5:$B$29,B6,別添!$J$5:$J$29,\"有\")>0,\"有\",\"\"),\"\")","v":""},{"$f":"SUMIFS(別添!K$5:K$29,別添!$B$5:$B$29,$B6)","v":0},{"$f":"SUMIFS(別添!L$5:L$29,別添!$B$5:$B$29,$B6)","v":0},{"$f":"SUMIFS(別添!M$5:M$29,別添!$B$5:$B$29,$B6)","v":0},0]
[3,null,{"$f":"IFERROR(VLOOKUP($B7,別添!$B$5:$G$29,2,FALSE),\"\")","v":0},{"$f":"IFERROR(VLOOKUP($B7,別添!$B$5:$G$29,4,FALSE),\"\")","v":0},{"$f":"IFERROR(VLOOKUP($B7,別添!$B$5:$G$29,5,FALSE),\"\")","v":0},{"$f":"IFERROR(VLOOKUP($B7,別添!$B$5:$G$29,6,FALSE),\"\")","v":""},{"$f":"IF(M7>0,申請書!$W$7,\"\")","v":""},{"$f":"SUMIFS(別添!I$5:I$29,別添!$B$5:$B$29,$B7)","v":0},{"$f":"IFERROR(IF(COUNTIFS(別添!$B$5:$B$29,B7,別添!$J$5:$J$29,\"有\")>0,\"有\",\"\"),\"\")","v":""},{"$f":"SUMIFS(別添!K$5:K$29,別添!$B$5:$B$29,$B7)","v":0},{"$f":"SUMIFS(別添!L$5:L$29,別添!$B$5:$B$29,$B7)","v":0},{"$f":"SUMIFS(別添!M$5:M$29,別添!$B$5:$B$29,$B7)","v":0},0]
[4,null,{"$f":"IFERROR(VLOOKUP($B8,別添!$B$5:$G$29,2,FALSE),\"\")","v":0},{"$f":"IFERROR(VLOOKUP($B8,別添!$B$5:$G$29,4,FALSE),\"\")","v":0},{"$f":"IFERROR(VLOOKUP($B8,別添!$B$5:$G$29,5,FALSE),\"\")","v":0},{"$f":"IFERROR(VLOOKUP($B8,別添!$B$5:$G$29,6,FALSE),\"\")","v":""},{"$f":"IF(M8>0,申請書!$W$7,\"\")","v":""},{"$f":"SUMIFS(別添!I$5:I$29,別添!$B$5:$B$29,$B8)","v":0},{"$f":"IFERROR(IF(COUNTIFS(別添!$B$5:$B$29,B8,別添!$J$5:$J$29,\"有\")>0,\"有\",\"\"),\"\")","v":""},{"$f":"SUMIFS(別添!K$5:K$29,別添!$B$5:$B$29,$B8)","v":0},{"$f":"SUMIFS(別添!L$5:L$29,別添!$B$5:$B$29,$B8)","v":0},{"$f":"SUMIFS(別添!M$5:M$29,別添!$B$5:$B$29,$B8)","v":0},0]
[5,null,{"$f":"IFERROR(VLOOKUP($B9,別添!$B$5:$G$29,2,FALSE),\"\")","v":0},{"$f":"IFERROR(VLOOKUP($B9,別添!$B$5:$G$29,4,FALSE),\"\")","v":0},{"$f":"IFERROR(VLOOKUP($B9,別添!$B$5:$G$29,5,FALSE),\"\")","v":0},{"$f":"IFERROR(VLOOKUP($B9,別添!$B$5:$G$29,6,FALSE),\"\")","v":""},{"$f":"IF(M9>0,申請書!$W$7,\"\")","v":""},{"$f":"SUMIFS(別添!I$5:I$29,別添!$B$5:$B$29,$B9)","v":0},{"$f":"IFERROR(IF(COUNTIFS(別添!$B$5:$B$29,B9,別添!$J$5:$J$29,\"有\")>0,\"有\",\"\"),\"\")","v":""},{"$f":"SUMIFS(別添!K$5:K$29,別添!$B$5:$B$29,$B9)","v":0},{"$f":"SUMIFS(別添!L$5:L$29,別添!$B$5:$B$29,$B9)","v":0},{"$f":"SUMIFS(別添!M$5:M$29,別添!$B$5:$B$29,$B9)","v":0},0]
[6,null,{"$f":"IFERROR(VLOOKUP($B10,別添!$B$5:$G$29,2,FALSE),\"\")","v":0},{"$f":"IFERROR(VLOOKUP($B10,別添!$B$5:$G$29,4,FALSE),\"\")","v":0},{"$f":"IFERROR(VLOOKUP($B10,別添!$B$5:$G$29,5,FALSE),\"\")","v":0},{"$f":"IFERROR(VLOOKUP($B10,別添!$B$5:$G$29,6,FALSE),\"\")","v":""},{"$f":"IF(M10>0,申請書!$W$7,\"\")","v":""},{"$f":"SUMIFS(別添!I$5:I$29,別添!$B$5:$B$29,$B10)","v":0},{"$f":"IFERROR(IF(COUNTIFS(別添!$B$5:$B$29,B10,別添!$J$5:$J$29,\"有\")>0,\"有\",\"\"),\"\")","v":""},{"$f":"SUMIFS(別添!K$5:K$29,別添!$B$5:$B$29,$B10)","v":0},{"$f":"SUMIFS(別添!L$5:L$29,別添!$B$5:$B$29,$B10)","v":0},{"$f":"SUMIFS(別添!M$5:M$29,別添!$B$5:$B$29,$B10)","v":0},0]
[7,null,{"$f":"IFERROR(VLOOKUP($B11,別添!$B$5:$G$29,2,FALSE),\"\")","v":0},{"$f":"IFERROR(VLOOKUP($B11,別添!$B$5:$G$29,4,FALSE),\"\")","v":0},{"$f":"IFERROR(VLOOKUP($B11,別添!$B$5:$G$29,5,FALSE),\"\")","v":0},{"$f":"IFERROR(VLOOKUP($B11,別添!$B$5:$G$29,6,FALSE),\"\")","v":""},{"$f":"IF(M11>0,申請書!$W$7,\"\")","v":""},{"$f":"SUMIFS(別添!I$5:I$29,別添!$B$5:$B$29,$B11)","v":0},{"$f":"IFERROR(IF(COUNTIFS(別添!$B$5:$B$29,B11,別添!$J$5:$J$29,\"有\")>0,\"有\",\"\"),\"\")","v":""},{"$f":"SUMIFS(別添!K$5:K$29,別添!$B$5:$B$29,$B11)","v":0},{"$f":"SUMIFS(別添!L$5:L$29,別添!$B$5:$B$29,$B11)","v":0},{"$f":"SUMIFS(別添!M$5:M$29,別添!$B$5:$B$29,$B11)","v":0},0]
[8,null,{"$f":"IFERROR(VLOOKUP($B12,別添!$B$5:$G$29,2,FALSE),\"\")","v":0},{"$f":"IFERROR(VLOOKUP($B12,別添!$B$5:$G$29,4,FALSE),\"\")","v":0},{"$f":"IFERROR(VLOOKUP($B12,別添!$B$5:$G$29,5,FALSE),\"\")","v":0},{"$f":"IFERROR(VLOOKUP($B12,別添!$B$5:$G$29,6,FALSE),\"\")","v":""},{"$f":"IF(M12>0,申請書!$W$7,\"\")","v":""},{"$f":"SUMIFS(別添!I$5:I$29,別添!$B$5:$B$29,$B12)","v":0},{"$f":"IFERROR(IF(COUNTIFS(別添!$B$5:$B$29,B12,別添!$J$5:$J$29,\"有\")>0,\"有\",\"\"),\"\")","v":""},{"$f":"SUMIFS(別添!K$5:K$29,別添!$B$5:$B$29,$B12)","v":0},{"$f":"SUMIFS(別添!L$5:L$29,別添!$B$5:$B$29,$B12)","v":0},{"$f":"SUMIFS(別添!M$5:M$29,別添!$B$5:$B$29,$B12)","v":0},0]
[9,null,{"$f":"IFERROR(VLOOKUP($B13,別添!$B$5:$G$29,2,FALSE),\"\")","v":0},{"$f":"IFERROR(VLOOKUP($B13,別添!$B$5:$G$29,4,FALSE),\"\")","v":0},{"$f":"IFERROR(VLOOKUP($B13,別添!$B$5:$G$29,5,FALSE),\"\")","v":0},{"$f":"IFERROR(VLOOKUP($B13,別添!$B$5:$G$29,6,FALSE),\"\")","v":""},{"$f":"IF(M13>0,申請書!$W$7,\"\")","v":""},{"$f":"SUMIFS(別添!I$5:I$29,別添!$B$5:$B$29,$B13)","v":0},{"$f":"IFERROR(IF(COUNTIFS(別添!$B$5:$B$29,B13,別添!$J$5:$J$29,\"有\")>0,\"有\",\"\"),\"\")","v":""},{"$f":"SUMIFS(別添!K$5:K$29,別添!$B$5:$B$29,$B13)","v":0},{"$f":"SUMIFS(別添!L$5:L$29,別添!$B$5:$B$29,$B13)","v":0},{"$f":"SUMIFS(別添!M$5:M$29,別添!$B$5:$B$29,$B13)","v":0},0]
[10,null,{"$f":"IFERROR(VLOOKUP($B14,別添!$B$5:$G$29,2,FALSE),\"\")","v":0},{"$f":"IFERROR(VLOOKUP($B14,別添!$B$5:$G$29,4,FALSE),\"\")","v":0},{"$f":"IFERROR(VLOOKUP($B14,別添!$B$5:$G$29,5,FALSE),\"\")","v":0},{"$f":"IFERROR(VLOOKUP($B14,別添!$B$5:$G$29,6,FALSE),\"\")","v":""},{"$f":"IF(M14>0,申請書!$W$7,\"\")","v":""},{"$f":"SUMIFS(別添!I$5:I$29,別添!$B$5:$B$29,$B14)","v":0},{"$f":"IFERROR(IF(COUNTIFS(別添!$B$5:$B$29,B14,別添!$J$5:$J$29,\"有\")>0,\"有\",\"\"),\"\")","v":""},{"$f":"SUMIFS(別添!K$5:K$29,別添!$B$5:$B$29,$B14)","v":0},{"$f":"SUMIFS(別添!L$5:L$29,別添!$B$5:$B$29,$B14)","v":0},{"$f":"SUMIFS(別添!M$5:M$29,別添!$B$5:$B$29,$B14)","v":0},0]
[11,null,{"$f":"IFERROR(VLOOKUP($B15,別添!$B$5:$G$29,2,FALSE),\"\")","v":0},{"$f":"IFERROR(VLOOKUP($B15,別添!$B$5:$G$29,4,FALSE),\"\")","v":0},{"$f":"IFERROR(VLOOKUP($B15,別添!$B$5:$G$29,5,FALSE),\"\")","v":0},{"$f":"IFERROR(VLOOKUP($B15,別添!$B$5:$G$29,6,FALSE),\"\")","v":""},{"$f":"IF(M15>0,申請書!$W$7,\"\")","v":""},{"$f":"SUMIFS(別添!I$5:I$29,別添!$B$5:$B$29,$B15)","v":0},{"$f":"IFERROR(IF(COUNTIFS(別添!$B$5:$B$29,B15,別添!$J$5:$J$29,\"有\")>0,\"有\",\"\"),\"\")","v":""},{"$f":"SUMIFS(別添!K$5:K$29,別添!$B$5:$B$29,$B15)","v":0},{"$f":"SUMIFS(別添!L$5:L$29,別添!$B$5:$B$29,$B15)","v":0},{"$f":"SUMIFS(別添!M$5:M$29,別添!$B$5:$B$29,$B15)","v":0},0]
{"$rows_left_out":90}
{"sheet":"別添","index":3,"n_rows":32,"n_cols":40,"rows_kept":32,"cut":false,"hidden":false,"merged":[[2,8,2,13],[2,0,3,0],[2,1,3,1],[2,2,3,2],[2,3,3,3],[2,4,3,4],[2,5,3,5],[2,6,3,6],[2,7,3,7]]}
["（別添）事業所・施設別申請額一覧（サービス別一覧）"]
[]
["No.","介護保険\n事業所番号","事業所・施設名","サービス種別","電話番号","郵便番号","住所","代表となる\n事業所・施設名","補助予定額（千円）"]
[null,null,null,null,null,null,null,null,"介護\n慰労金","20万円\n対象者の\n有無","感染対策\n費用助成\n事業","個別再開\n支援助成\n事業","再開環境\n整備助成\n事業","合計"]
[{"$f":"ROW()-4","v":1},{"$f":"IFERROR(INDIRECT(\"個票\"&$A5&\"！$h$7\"),\"\")","v":0},{"$f":"IFERROR(INDIRECT(\"個票\"&$A5&\"！$t$7\"),\"\")","v":0},{"$f":"IFERROR(INDIRECT(\"個票\"&$A5&\"！$h$10\"),\"\")","v":0},{"$f":"IFERROR(INDIRECT(\"個票\"&$A5&\"！$AC$9\"),\"\")","v":0},{"$f":"IFERROR(INDIRECT(\"個票\"&$A5&\"！$d$9\"),\"\")","v":0},{"$f":"IFERROR(INDIRECT(\"個票\"&$A5&\"！$H$9\")&INDIRECT(\"個票\"&$A5&\"！$L$9\"),\"\")","v":""},{"$f":"IF(N5>0,申請書!$W$7,\"\")","v":""},{"$f":"IFERROR(INDIRECT(\"個票\"&$A5&\"！$ai$21\"),\"\")","v":0},{"$f":"IFERROR(INDIRECT(\"個票\"&$A5&\"！$ao$22\"),\"\")","v":0},{"$f":"IFERROR(INDIRECT(\"個票\"&$A5&\"！$ai$24\"),\"\")","v":0},{"$f":"IFERROR(INDIRECT(\"個票\"&$A5&\"！$ai$39\"),\"\")","v":0},{"$f":"IFERROR(INDIRECT(\"個票\"&$A5&\"！$ai$47\"),\"\")","v":0},{"$f":"SUM(I5,K5,L5,M5)","v":0},null,null,{"$f":"IF(_xlfn.SHEETS()-6=COUNTIF(N5:N32,\">0\"),\"○\",\"！（本表の事業所数と個票の枚数が一致しません）\")","v":{"$error":"#NAME?"}},null,null,null,null,null,null,null,null,null,null,null,null,null,null,null,null,null,null,null,null,null,{"$f":"IFERROR(INDIRECT(\"個票\"&$A5&\"！$m$22\"),\"\")","v":0},{"$f":"IFERROR(INDIRECT(\"個票\"&$A5&\"！$v$22\"),\"\")","v":0}]
[2,"","","","","","",{"$f":"IF(N6>0,申請書!$W$7,\"\")","v":""},"","","","","",0,null,null,null,null,null,null,null,null,null,null,null,null,null,null,null,null,null,null,null,null,null,null,null,null,"",""]
[3,"","","","","","",{"$f":"IF(N7>0,申請書!$W$7,\"\")","v":""},"","","","","",0,null,null,null,null,null,null,null,null,null,null,null,null,null,null,null,null,null,null,null,null,null,null,null,null,"",""]
[4,"","","","","","",{"$f":"IF(N8>0,申請書!$W$7,\"\")","v":""},"","","","","",0,null,null,null,null,null,null,null,null,null,null,null,null,null,null,null,null,null,null,null,null,null,null,null,null,"",""]
[5,"","","","","","",{"$f":"IF(N9>0,申請書!$W$7,\"\")","v":""},"","","","","",0,null,null,null,null,null,null,null,null,null,null,null,null,null,null,null,null,null,null,null,null,null,null,null,null,"",""]
[6,"","","","","","",{"$f":"IF(N10>0,申請書!$W$7,\"\")","v":""},"","","","","",0,null,null,null,null,null,null,null,null,null,null,null,null,null,null,null,null,null,null,null,null,null,null,null,null,"",""]
[7,"","","","","","",{"$f":"IF(N11>0,申請書!$W$7,\"\")","v":""},"","","","","",0,null,null,null,null,null,null,null,null,null,null,null,null,null,null,null,null,null,null,null,null,null,null,null,null,"",""]
[8,"","","","","","",{"$f":"IF(N12>0,申請書!$W$7,\"\")","v":""},"","","","","",0,null,null,null,null,null,null,null,null,null,null,null,null,null,null,null,null,null,null,null,null,null,null,null,null,"",""]
[9,"","","","","","",{"$f":"IF(N13>0,申請書!$W$7,\"\")","v":""},"","","","","",0,null,null,null,null,null,null,null,null,null,null,null,null,null,null,null,null,null,null,null,null,null,null,null,null,"",""]
[10,"","","","","","",{"$f":"IF(N14>0,申請書!$W$7,\"\")","v":""},"","","","","",0,null,null,null,null,null,null,null,null,null,null,null,null,null,null,null,null,null,null,null,null,null,null,null,null,"",""]
[11,"","","","","","",{"$f":"IF(N15>0,申請書!$W$7,\"\")","v":""},"","","","","",0,null,null,null,null,null,null,null,null,null,null,null,null,null,null,null,null,null,null,null,null,null,null,null,null,"",""]
{"$rows_left_out":18}
{"sheet":"個票1","index":4,"n_rows":62,"n_cols":84,"rows_kept":62,"cut":false,"hidden":false,"merged":[[2,0,2,38],[4,0,4,38],[6,0,6,6],[6,7,6,13],[6,14,6,18],[6,19,6,38],[7,3,7,6],[7,7,7,10],[7,11,7,24],[7,28,7,32],[7,33,7,38],[8,3,8,6],[8,7,8,10],[8,11,8,24],[8,28,8,32],[8,33,8,38],[9,0,9,6],[9,7,9,16],[9,17,9,22],[9,23,9,24],[9,25,9,27],[9,28,9,29],[9,30,9,31],[9,32,9,34],[9,35,9,36],[9,37,9,38],[9,41,9,46],[13,0,13,38],[15,23,15,25],[15,26,15,38],[16,23,16,25],[16,26,16,38],[18,0,18,38],[20,30,20,33],[20,34,20,36],[20,37,20,38],[21,7,21,11],[21,12,21,14],[21,16,21,20],[21,21,21,23],[21,30,21,32],[23,23,23,27],[23,34,23,36],[23,37,23,38],[24,34,24,36],[24,37,24,38],[25,34,25,36],[25,37,25,38],[26,0,26,6],[26,7,26,11],[26,12,26,38],[27,7,27,11],[27,12,27,38],[28,7,28,11],[28,12,28,38],[29,7,29,11],[29,12,29,38],[30,7,30,11],[30,12,30,38],[31,7,31,11],[31,12,31,38],[32,7,32,11],[32,12,32,38],[33,7,33,11],[33,12,33,38],[34,7,34,11],[34,12,34,38],[35,7,35,11],[35,12,35,38],[36,7,36,11],[36,12,36,38],[38,30,38,33],[38,34,38,36],[38,37,38,38],[39,23,39,25],[39,26,39,27],[39,28,39,33],[39,34,39,36],[39,37,39,38],[40,23,40,25],[40,26,40,27],[40,28,40,33],[40,34,40,36],[40,37,40,38],[41,23,41,25],[41,26,41,27],[41,28,41,33],[41,34,41,36],[41,37,41,38],[42,23,42,25],[42,26,42,27],[42,28,42,33],[42,34,42,36],[42,37,42,38],[43,23,43,25],[43,26,43,27],[43,28,43,33],[43,34,43,36],[43,37,43,38],[44,23,44,25],[44,26,44,27],[44,28,44,33],[44,34,44,36],[44,37,44,38],[46,23,46,27],[46,34,46,36],[46,37,46,38],[47,34,47,36],[47,37,47,38],[48,34,48,36],[48,37,48,38],[49,0,49,6],[49,7,49,11],[49,12,49,38],[50,7,50,11],[50,12,50,38],[51,7,51,11],[51,12,51,38],[52,7,52,11],[52,12,52,38],[53,7,53,11],[53,12,53,38],[54,7,54,11],[54,12,54,38],[55,7,55,11],[55,12,55,38],[56,7,56,11],[56,12,56,38],[57,7,57,11],[57,12,57,38],[58,7,58,11],[58,12,58,38],[59,7,59,11],[59,12,59,38],[7,0,8,2],[7,25,8,27],[10,0,11,7],[23,28,25,28],[24,23,25,25],[24,26,25,27],[39,0,40,9],[41,1,44,9],[46,28,48,28],[47,23,48,25],[47,26,48,27]]}
["（別紙様式２）"]
[]
["新型コロナウイルス感染症緊急包括支援交付金（介護分）に関する変更事業計画書（事業所単位）",null,null,null,null,null,null,null,null,null,null,null,null,null,null,null,null,null,null,null,null,null,null,null,null,null,null,null,null,null,null,null,null,null,null,null,null,null,null,null,null,null,null,null,null,null,null,null,null,null,null,null,null,null,null,null,null,null,null,null,null,null,null,null,null,null,null,null,null,null,null,null,null,null,null,null,null,null,null,"（１）①　",null,null,"（２）②"]
[null,null,null,null,null,null,null,null,null,null,null,null,null,null,null,null,null,null,null,null,null,null,null,null,null,null,null,null,null,null,null,null,null,null,null,null,null,null,null,null,null,null,null,null,null,null,null,null,null,null,null,null,null,null,null,null,null,null,null,null,null,null,null,null,null,null,null,null,null,null,null,null,null,null,null,null,null,null,null,"共通",null,"単価","共通"]
["施設概要",null,null,null,null,null,null,null,null,null,null,null,null,null,null,null,null,null,null,null,null,null,null,null,null,null,null,null,null,null,null,null,null,null,null,null,null,null,null,null,null,null,null,null,null,null,null,null,null,null,null,null,null,null,null,null,null,null,null,null,null,null,null,null,null,null,null,null,null,null,null,null,null,null,null,null,null,null,"通所介護事業所（通常規模型）",892,"/事業所",null,200,"/事業所"]
[null,null,null,null,null,null,null,null,null,null,null,null,null,null,null,null,null,null,null,null,null,null,null,null,null,null,null,null,null,null,null,null,null,null,null,null,null,null,null,null,null,null,null,null,null,null,null,null,null,null,null,null,null,null,null,null,null,null,null,null,null,null,null,null,null,null,null,null,null,null,null,null,null,null,null,null,null,null,"通所介護事業所（大規模型（Ⅰ））",1137,"/事業所",null,200,"/事業所"]
["介護保険事業所番号",null,null,null,null,null,null,null,null,null,null,null,null,null,"事業所名称",null,null,null,null,null,null,null,null,null,null,null,null,null,null,null,null,null,null,null,null,null,null,null,null,null,null,null,null,null,null,null,null,null,null,null,null,null,null,null,null,null,null,null,null,null,null,null,null,null,null,null,null,null,null,null,null,null,null,null,null,null,null,null,"通所介護事業所（大規模型（Ⅱ））",1480,"/事業所",null,200,"/事業所"]
["所在地",null,null,"郵便番号",null,null,null,"都道府県名",null,null,null,"住所",null,null,null,null,null,null,null,null,null,null,null,null,null,"連絡先",null,null,"電話番号",null,null,null,null,"担当部署名",null,null,null,null,null,null,null,null,null,null,null,null,null,null,null,null,null,null,null,null,null,null,null,null,null,null,null,null,null,null,null,null,null,null,null,null,null,null,null,null,null,null,null,null,"地域密着型通所介護事業所(療養通所介護事業所を含む)",384,"/事業所",null,200,"/事業所"]
[null,null,null,null,null,null,null,null,null,null,null,null,null,null,null,null,null,null,null,null,null,null,null,null,null,null,null,null,null,null,null,null,null,null,null,null,null,null,null,null,null,null,null,null,null,null,null,null,null,null,null,null,null,null,null,null,null,null,null,null,null,null,null,null,null,null,null,null,null,null,null,null,null,null,null,null,null,null,"認知症対応型通所介護事業所",375,"/事業所",null,200,"/事業所"]
["提供サービス",null,null,null,null,null,null,null,null,null,null,null,null,null,null,null,null,"サービス種類コード",null,null,null,null,null,null,null,"定員",null,null,null,null,"人",null,"職員数\n(派遣含む)",null,null,null,null,"人",null,null,null,null,null,null,null,null,null,null,null,null,null,null,null,null,null,null,null,null,null,null,null,null,null,null,null,null,null,null,null,null,null,null,null,null,null,null,null,null,"通所リハビリテーション事業所（通常規模型）",939,"/事業所",null,200,"/事業所"]
["事業区分",null,null,null,null,null,null,null,null," 介護慰労金事業　→　1を記載",null,null,null,null,null,null,null,null,null,null,null,null,null,null,null,"  感染対策費用助成事業　→ 2を記載",null,null,null,null,null,null,null,null,null,null,null,null,null,null,null,null,null,null,null,null,null,null,null,null,null,null,null,null,null,null,null,null,null,null,null,null,null,null,null,null,null,null,null,null,null,null,null,null,null,null,null,null,"通所リハビリテーション事業所（大規模型（Ⅰ））",1181,"/事業所",null,200,"/事業所"]
[null,null,null,null,null,null,null,null,null," 個別再開支援助成事業　→ 3を記載",null,null,null,null,null,null,null,null,null,null,null,null,null,null,null,"　再開環境整備助成事業　→ 4を記載",null,null,null,null,null,null,null,null,null,null,null,null,null,null,null,null,null,null,null,null,null,null,null,null,null,null,null,null,null,null,null,null,null,null,null,null,null,null,null,null,null,null,null,null,null,null,null,null,null,null,null,null,"通所リハビリテーション事業所（大規模型（Ⅱ））",1885,"/事業所",null,200,"/事業所"]
[null,null,null,null,null,null,null,null,null,null,null,null,null,null,null,null,null,null,null,null,null,null,null,null,null,null,null,null,null,null,null,null,null,null,null,null,null,null,null,null,null,null,null,null,null,null,null,null,null,null,null,null,null,null,null,null,null,null,null,null,null,null,null,null,null,null,null,null,null,null,null,null,null,null,null,null,null,null,"短期入所生活介護事業所",{"$f":"CD13*個票1!$AC$10","v":0},"/定員",44,200,"/事業所"]
["口座情報",null,null,null,null,null,null,null,null,null,null,null,null,null,null,null,null,null,null,null,null,null,null,null,null,null,null,null,null,null,null,null,null,null,null,null,null,null,null,null,null,null,null,null,null,null,null,null,null,null,null,null,null,null,null,null,null,null,null,null,null,null,null,null,null,null,null,null,null,null,null,null,null,null,null,null,null,null,"短期入所療養介護事業所",{"$f":"CD14*個票1!$AC$10","v":0},"/定員",44,200,"/事業所"]
[null,null,null,null,null,null,null,null,null,null,null,null,null,null,null,null,null,null,null,null,null,null,null,null,null,null,null,null,null,null,null,null,null,null,null,null,null,null,null,null,null,null,null,null,null,null,null,null,null,null,null,null,null,null,null,null,null,null,null,null,null,null,null,null,null,null,null,null,null,null,null,null,null,null,null,null,null,null,"訪問介護事業所",534,"/事業所",null,200,"/事業所"]
{"$rows_left_out":48}
{"sheet":"職員表","index":5,"n_rows":85,"n_cols":21,"rows_kept":85,"cut":false,"hidden":false,"merged":[[3,7,3,9],[3,10,3,13],[3,15,3,18],[3,19,3,20],[3,0,4,0],[3,1,4,1],[3,2,4,2],[3,3,4,3],[3,6,4,6],[3,14,4,14]]}
["（別紙様式３）介護慰労金受給職員表（法人単位）"]
[]
["※　本表は法人単位でまとめて記載すること。"]
[null,"氏名\n（漢字）","氏名\n（全角カナ）","生年月日\n（西暦）",null,null,"本人の住所","主たる勤務先",null,null,"分類",null,null,null,"慰労金\n(万円)","確認事項",null,null,null,"支払実績"]
[null,null,null,null,"（確認用）","（確認用）",null,"事業所番号","サービス種類コード","事業所・施設の名称","施設区分","対応区分","(計算用)","他の施設等との期間通算がある場合その施設名",null,"委任状の有無","他法人での慰労金の申請の有無","業務委託による\n従事者","重複\n申請者確認用","支払年月日\n(西暦)","支払金額\n（円）"]
[{"$f":"ROW()-5","v":1},null,null,null,{"$f":"B6&C6&D6","v":""},{"$f":"IF(E6=\"\",\"\",COUNTIF($E$6:$E$85,E6))","v":""},null,null,null,null,null,null,{"$f":"K6&L6","v":""},null,{"$f":"IFERROR(VLOOKUP(M6,計算用!$A$8:$B$15,2,FALSE),\"\")","v":""},null,null,null,{"$f":"IF(F6>=2,\"\",\"可\")","v":""}]
[2,null,null,null,"","",null,null,null,null,null,null,"",null,{"$f":"IFERROR(VLOOKUP(M7,計算用!$A$8:$B$15,2,FALSE),\"\")","v":""},null,null,null,""]
[3,null,null,null,"","",null,null,null,null,null,null,"",null,{"$f":"IFERROR(VLOOKUP(M8,計算用!$A$8:$B$15,2,FALSE),\"\")","v":""},null,null,null,""]
[4,null,null,null,"","",null,null,null,null,null,null,"",null,{"$f":"IFERROR(VLOOKUP(M9,計算用!$A$8:$B$15,2,FALSE),\"\")","v":""},null,null,null,""]
[5,null,null,null,"","",null,null,null,null,null,null,"",null,{"$f":"IFERROR(VLOOKUP(M10,計算用!$A$8:$B$15,2,FALSE),\"\")","v":""},null,null,null,""]
[6,null,null,null,"","",null,null,null,null,null,null,"",null,{"$f":"IFERROR(VLOOKUP(M11,計算用!$A$8:$B$15,2,FALSE),\"\")","v":""},null,null,null,""]
[7,null,null,null,"","",null,null,null,null,null,null,"",null,{"$f":"IFERROR(VLOOKUP(M12,計算用!$A$8:$B$15,2,FALSE),\"\")","v":""},null,null,null,""]
[8,null,null,null,"","",null,null,null,null,null,null,"",null,{"$f":"IFERROR(VLOOKUP(M13,計算用!$A$8:$B$15,2,FALSE),\"\")","v":""},null,null,null,""]
[9,null,null,null,"","",null,null,null,null,null,null,"",null,{"$f":"IFERROR(VLOOKUP(M14,計算用!$A$8:$B$15,2,FALSE),\"\")","v":""},null,null,null,""]
[10,null,null,null,"","",null,null,null,null,null,null,"",null,{"$f":"IFERROR(VLOOKUP(M15,計算用!$A$8:$B$15,2,FALSE),\"\")","v":""},null,null,null,""]
{"$rows_left_out":71}
{"sheet":"計算用","index":6,"n_rows":67,"n_cols":8,"rows_kept":67,"cut":false,"hidden":true,"merged":[]}
[null,null,null,null,null,null,null,"※本シートは絶対に編集しないこと。"]
["施設区分"]
["陽性者(濃厚接触者)発生施設","通所系･施設系で1日以上勤務又は訪問系で陽性者等に1日以上対応","訪問系で陽性者等への対応はないが対象期間に10日以上勤務","対象期間の勤務が９日以下"]
["その他の施設","対象期間に10日以上勤務","対象期間の勤務が9日以下"]
[]
[]
["慰労金単価"]
[{"$f":"A3&B3","v":"陽性者(濃厚接触者)発生施設通所系･施設系で1日以上勤務又は訪問系で陽性者等に1日以上対応"},20]
[{"$f":"A3&C3","v":"陽性者(濃厚接触者)発生施設訪問系で陽性者等への対応はないが対象期間に10日以上勤務"},5]
[{"$f":"A3&D3","v":"陽性者(濃厚接触者)発生施設対象期間の勤務が９日以下"},0]
[{"$f":"A4&B4","v":"その他の施設対象期間に10日以上勤務"},5]
[{"$f":"A4&C4","v":"その他の施設対象期間の勤務が9日以下"},0]
[]
[]
[]
{"$rows_left_out":52}